Reaction Details
TargetSodium-dependent serotonin transporter
LigandBDBM50173712
Substrate/Competitorn/a
Meas. Tech.ChEMBL_320797 (CHEMBL884752)
Ki 1.8±n/a nM
Citation Mattson, RJCatt, JDDenhart, DJDeskus, JADitta, JLHiggins, MAMarcin, LRSloan, CPBeno, BRGao, QCunningham, MAMattson, GKMolski, TFTaber, MTLodge, NJ Conformationally restricted homotryptamines. 2. Indole cyclopropylmethylamines as selective serotonin reuptake inhibitors. J Med Chem48:6023-34 (2005) 
 
Sodium-dependent serotonin transporter
Name:Sodium-dependent serotonin transporter
Type:Multi-pass membrane protein
Mol. Mass.:70322.51
Organism:Homo sapiens (Human)
Description:P31645
Residue:630
BDBM50173712
NameBDBM50173712
Synonyms:3-((1S,2S)-2-Dimethylaminomethyl-cyclopropyl)-1-ethyl-1H-indole-5-carbonitrile | CHEMBL199054
TypeSmall organic molecule
Emp. Form.C17H21N3
Mol. Mass.267.3687
SMILESCCn1cc([C@H]2C[C@@H]2CN(C)C)c2cc(ccc12)C#N