Reaction Details
TargetH(+)-exporting diphosphatase
LigandBDBM50173796
Substrate/Competitorn/a
Meas. Tech.ChEMBL_321446 (CHEMBL880254)
IC50 6500±n/a nM
Citation Kotsikorou, ESong, YChan, JMFaelens, STovian, ZBroderick, EBakalara, NDocampo, ROldfield, E Bisphosphonate inhibition of the exopolyphosphatase activity of the Trypanosoma brucei soluble vacuolar pyrophosphatase. J Med Chem48:6128-39 (2005) 
 
H(+)-exporting diphosphatase
Name:H(+)-exporting diphosphatase
Synonyms:Vacuolar-type proton translocating pyrophosphatase 1
Type:PROTEIN
Mol. Mass.:85914.14
Organism:Trypanosoma brucei
Description:ChEMBL_321446
Residue:826
BDBM50173796
NameBDBM50173796
TypeSmall organic molecule
Emp. Form.C7H10N2O8P2
Mol. Mass.312.1104
SMILESOP(O)(=O)C(Nc1cccc(c1)[N+]([O-])=O)P(O)(O)=O