Reaction Details
TargetIntegrin alpha-V/beta-3
LigandBDBM50370689
Substrate/Competitorn/a
Meas. Tech.ChEMBL_325767 (CHEMBL863347)
IC50 1.4±n/a nM
Citation Casiraghi, GRassu, GAuzzas, LBurreddu, PGaetani, EBattistini, LZanardi, FCurti, CNicastro, GBelvisi, LMotto, ICastorina, MGiannini, GPisano, C Grafting aminocyclopentane carboxylic acids onto the RGD tripeptide sequence generates low nanomolar alphaVbeta3/alphaVbeta5 integrin dual binders. J Med Chem48:7675-87 (2005) 
 
Integrin alpha-V/beta-3
Name:Integrin alpha-V/beta-3
Type:Enzyme
Mol. Mass.:n/a
Description:n/a
Components:This complex has 2 components.
Component 1
Name:Integrin alpha-V
Synonyms:ITAV_HUMAN Integrin alpha-V/alpha-5 VNRA Vitronectin receptor | Vitronectin receptor subunit alpha
Type:PROTEIN
Mol. Mass.:116024.92
Organism:Homo sapiens (Human)
Description:ChEMBL_582336
Residue:1048
Component 2
Name:Integrin beta-3
Synonyms:CD_antigen=CD61 GPIIIa ITGB3 Platelet membrane glycoprotein IIIa
Type:Protein
Mol. Mass.:87038.91
Organism:Homo sapiens (Human)
Description:P05106
Residue:788
BDBM50370689
NameBDBM50370689
Synonyms:CHEMBL392303 | ST-1646
TypeSmall organic molecule
Emp. Form.C21H33N7O6
Mol. Mass.479.53
SMILES[#7]\[#6](-[#7])=[#7]\[#6]-[#6]-[#6]-[#6@@H]-1-[#7]-[#6](=O)-[#6]-[#7]-[#6](=O)-[#6@@H](-[#6]-[#6](-[#8])=O)-[#7]-[#6@H]-2-[#6]-[#6]-[#6]-[#6@H]-3-[#6]-[#6]-[#6@@H](-[#7]-3-[#6]-2=O)-[#6]-1=O