Reaction Details
TargetC-C chemokine receptor type 1
LigandBDBM50174709
Substrate/Competitorn/a
Meas. Tech.ChEMBL_325887 (CHEMBL863244)
IC50 7±n/a nM
Citation Revesz, LBollbuck, BBuhl, TEder, JEsser, RFeifel, RHeng, RHiestand, PJachez-Demange, BLoetscher, PSparrer, HSchlapbach, AWaelchli, R Novel CCR1 antagonists with oral activity in the mouse collagen induced arthritis. Bioorg Med Chem Lett15:5160-4 (2005) 
 
C-C chemokine receptor type 1
Name:C-C chemokine receptor type 1
Type:Enzyme
Mol. Mass.:41180.69
Organism:Homo sapiens (Human)
Description:P32246
Residue:355
BDBM50174709
NameBDBM50174709
Synonyms:CHEMBL372807 | N-(2-(3-(3-(4-fluorobenzyl)-3,8-diaza-bicyclo[3.2.1]octan-8-yl)-3-oxoprop-1-enyl)-5-chloro-4-methoxyphenyl)acetamide
TypeSmall organic molecule
Emp. Form.C25H27ClFN3O3
Mol. Mass.471.952
SMILESCOc1cc(\C=C\C(=O)N2C3CCC2CN(Cc2ccc(F)cc2)C3)c(NC(C)=O)cc1Cl