Reaction Details
TargetC-C chemokine receptor type 1
LigandBDBM50174706
Substrate/Competitorn/a
Meas. Tech.ChEMBL_325889 (CHEMBL863246)
IC50 500±n/a nM
Citation Revesz, LBollbuck, BBuhl, TEder, JEsser, RFeifel, RHeng, RHiestand, PJachez-Demange, BLoetscher, PSparrer, HSchlapbach, AWaelchli, R Novel CCR1 antagonists with oral activity in the mouse collagen induced arthritis. Bioorg Med Chem Lett15:5160-4 (2005) 
 
C-C chemokine receptor type 1
Name:C-C chemokine receptor type 1
Type:PROTEIN
Mol. Mass.:40904.59
Organism:Mus musculus
Description:ChEMBL_1452291
Residue:355
BDBM50174706
NameBDBM50174706
Synonyms:(R)-N-(3-(3-(4-(4-fluorobenzyl)-2-methylpiperazin-1-yl)-3-oxoprop-1-enyl)naphthalen-2-yl)acetamide | CHEMBL370596
TypeSmall organic molecule
Emp. Form.C27H28FN3O2
Mol. Mass.445.5285
SMILESC[C@@H]1CN(Cc2ccc(F)cc2)CCN1C(=O)\C=C\c1cc2ccccc2cc1NC(C)=O