Reaction Details
TargetC-C chemokine receptor type 1
LigandBDBM50174715
Substrate/Competitorn/a
Meas. Tech.ChEMBL_325887 (CHEMBL863244)
IC50 200±n/a nM
Citation Revesz, LBollbuck, BBuhl, TEder, JEsser, RFeifel, RHeng, RHiestand, PJachez-Demange, BLoetscher, PSparrer, HSchlapbach, AWaelchli, R Novel CCR1 antagonists with oral activity in the mouse collagen induced arthritis. Bioorg Med Chem Lett15:5160-4 (2005) 
 
C-C chemokine receptor type 1
Name:C-C chemokine receptor type 1
Type:Enzyme
Mol. Mass.:41180.69
Organism:Homo sapiens (Human)
Description:P32246
Residue:355
BDBM50174715
NameBDBM50174715
Synonyms:CHEMBL380568 | N-(2-(3-(3-(4-fluorobenzyl)-3,8-diaza-bicyclo[3.2.1]octan-8-yl)-3-oxoprop-1-enyl)-5-chlorophenyl)acetamide
TypeSmall organic molecule
Emp. Form.C24H25ClFN3O2
Mol. Mass.441.926
SMILESCC(=O)Nc1cc(Cl)ccc1\C=C\C(=O)N1C2CCC1CN(Cc1ccc(F)cc1)C2