Reaction Details
Target5-hydroxytryptamine receptor 2A
LigandBDBM50174702
Substrate/Competitorn/a
Meas. Tech.ChEMBL_325904 (CHEMBL863271)
IC50>1000±n/a nM
Citation Revesz, LBollbuck, BBuhl, TEder, JEsser, RFeifel, RHeng, RHiestand, PJachez-Demange, BLoetscher, PSparrer, HSchlapbach, AWaelchli, R Novel CCR1 antagonists with oral activity in the mouse collagen induced arthritis. Bioorg Med Chem Lett15:5160-4 (2005) 
 
5-hydroxytryptamine receptor 2A
Name:5-hydroxytryptamine receptor 2A
Type:undefined
Mol. Mass.:52607.65
Organism:Homo sapiens (Human)
Description:P28223
Residue:471
BDBM50174702
NameBDBM50174702
Synonyms:(R)-N-(2-(3-(4-(4-fluorobenzyl)-2-methylpiperazin-1-yl)-3-oxoprop-1-enyl)-5-chlorophenyl)acetamide | CHEMBL198949
TypeSmall organic molecule
Emp. Form.C23H25ClFN3O2
Mol. Mass.429.915
SMILESC[C@@H]1CN(Cc2ccc(F)cc2)CCN1C(=O)\C=C\c1ccc(Cl)cc1NC(C)=O