Reaction Details
TargetC-C chemokine receptor type 1
LigandBDBM50174722
Substrate/Competitorn/a
Meas. Tech.ChEMBL_325887 (CHEMBL863244)
IC50 360±n/a nM
Citation Revesz, LBollbuck, BBuhl, TEder, JEsser, RFeifel, RHeng, RHiestand, PJachez-Demange, BLoetscher, PSparrer, HSchlapbach, AWaelchli, R Novel CCR1 antagonists with oral activity in the mouse collagen induced arthritis. Bioorg Med Chem Lett15:5160-4 (2005) 
 
C-C chemokine receptor type 1
Name:C-C chemokine receptor type 1
Type:Enzyme
Mol. Mass.:41180.69
Organism:Homo sapiens (Human)
Description:P32246
Residue:355
BDBM50174722
NameBDBM50174722
Synonyms:(R)-N-(2-(3-(4-(4-fluorobenzyl)-2-methylpiperazin-1-yl)-3-oxopropyl)-5-chlorophenyl)acetamide | CHEMBL381446
TypeSmall organic molecule
Emp. Form.C23H27ClFN3O2
Mol. Mass.431.931
SMILESC[C@@H]1CN(Cc2ccc(F)cc2)CCN1C(=O)CCc1ccc(Cl)cc1NC(C)=O