Reaction Details
TargetC-C chemokine receptor type 1
LigandBDBM50174703
Substrate/Competitorn/a
Meas. Tech.ChEMBL_325890 (CHEMBL863247)
IC50 0.400000±n/a nM
Citation Revesz, LBollbuck, BBuhl, TEder, JEsser, RFeifel, RHeng, RHiestand, PJachez-Demange, BLoetscher, PSparrer, HSchlapbach, AWaelchli, R Novel CCR1 antagonists with oral activity in the mouse collagen induced arthritis. Bioorg Med Chem Lett15:5160-4 (2005) 
 
C-C chemokine receptor type 1
Name:C-C chemokine receptor type 1
Type:Enzyme
Mol. Mass.:41180.69
Organism:Homo sapiens (Human)
Description:P32246
Residue:355
BDBM50174703
NameBDBM50174703
Synonyms:(R)-1-(2-(2-(4-(4-fluorobenzyl)-2-methylpiperazin-1-yl)-2-oxoethoxy)-5-chlorophenyl)urea hydrochloride | CHEMBL535607
TypeSmall organic molecule
Emp. Form.C21H24ClFN4O3
Mol. Mass.434.892
SMILESC[C@@H]1CN(Cc2ccc(F)cc2)CCN1C(=O)COc1ccc(Cl)cc1NC(N)=O