Reaction Details
TargetMu-type opioid receptor
LigandBDBM50174702
Substrate/Competitorn/a
Meas. Tech.ChEMBL_325925 (CHEMBL869395)
IC50>1000±n/a nM
Citation Revesz, LBollbuck, BBuhl, TEder, JEsser, RFeifel, RHeng, RHiestand, PJachez-Demange, BLoetscher, PSparrer, HSchlapbach, AWaelchli, R Novel CCR1 antagonists with oral activity in the mouse collagen induced arthritis. Bioorg Med Chem Lett15:5160-4 (2005) 
 
Mu-type opioid receptor
Name:Mu-type opioid receptor
Type:G Protein-Coupled Receptor (GPCR)
Mol. Mass.:44789.51
Organism:Homo sapiens (Human)
Description:P35372
Residue:400
BDBM50174702
NameBDBM50174702
Synonyms:(R)-N-(2-(3-(4-(4-fluorobenzyl)-2-methylpiperazin-1-yl)-3-oxoprop-1-enyl)-5-chlorophenyl)acetamide | CHEMBL198949
TypeSmall organic molecule
Emp. Form.C23H25ClFN3O2
Mol. Mass.429.915
SMILESC[C@@H]1CN(Cc2ccc(F)cc2)CCN1C(=O)\C=C\c1ccc(Cl)cc1NC(C)=O