Reaction Details
TargetMuscarinic acetylcholine receptor M3
LigandBDBM50176718
Substrate/Competitorn/a
Meas. Tech.ChEMBL_327855 (CHEMBL863985)
Ki 0.2±n/a nM
Citation Starck, JPTalaga, PQuéré, LCollart, PChristophe, BLo Brutto, PJadot, SChimmanamada, DZanda, MWagner, AMioskowski, CMassingham, RGuyaux, M Potent anti-muscarinic activity in a novel series of quinuclidine derivatives. Bioorg Med Chem Lett16:373-7 (2005) 
 
Muscarinic acetylcholine receptor M3
Name:Muscarinic acetylcholine receptor M3
Type:Enzyme
Mol. Mass.:66151.03
Organism:Homo sapiens (Human)
Description:P20309
Residue:590
BDBM50176718
NameBDBM50176718
Synonyms:1-cyclohexyl-3-((R)-3-methoxyquinuclidin-3-yl)-1-phenylprop-2-yn-1-ol | CHEMBL200693
TypeSmall organic molecule
Emp. Form.C23H31NO2
Mol. Mass.353.4977
SMILESCO[C@@]1(CN2CCC1CC2)C#CC(O)(C1CCCCC1)c1ccccc1