Reaction Details
TargetMuscarinic acetylcholine receptor M3
LigandBDBM50176712
Substrate/Competitorn/a
Meas. Tech.ChEMBL_327855 (CHEMBL863985)
Ki 0.25±n/a nM
Citation Starck, JPTalaga, PQuéré, LCollart, PChristophe, BLo Brutto, PJadot, SChimmanamada, DZanda, MWagner, AMioskowski, CMassingham, RGuyaux, M Potent anti-muscarinic activity in a novel series of quinuclidine derivatives. Bioorg Med Chem Lett16:373-7 (2005) 
 
Muscarinic acetylcholine receptor M3
Name:Muscarinic acetylcholine receptor M3
Type:Enzyme
Mol. Mass.:66151.03
Organism:Homo sapiens (Human)
Description:P20309
Residue:590
BDBM50176712
NameBDBM50176712
Synonyms:1-cyclopentyl-3-(3-methoxyquinuclidin-3-yl)-1-phenylprop-2-yn-1-ol | CHEMBL200432
TypeSmall organic molecule
Emp. Form.C22H29NO2
Mol. Mass.339.4712
SMILESCOC1(CN2CCC1CC2)C#CC(O)(C1CCCC1)c1ccccc1