Reaction Details
TargetMuscarinic acetylcholine receptor M3
LigandBDBM50176720
Substrate/Competitorn/a
Meas. Tech.ChEMBL_327855 (CHEMBL863985)
Ki 13±n/a nM
Citation Starck, JPTalaga, PQuéré, LCollart, PChristophe, BLo Brutto, PJadot, SChimmanamada, DZanda, MWagner, AMioskowski, CMassingham, RGuyaux, M Potent anti-muscarinic activity in a novel series of quinuclidine derivatives. Bioorg Med Chem Lett16:373-7 (2005) 
 
Muscarinic acetylcholine receptor M3
Name:Muscarinic acetylcholine receptor M3
Type:Enzyme
Mol. Mass.:66151.03
Organism:Homo sapiens (Human)
Description:P20309
Residue:590
BDBM50176720
NameBDBM50176720
Synonyms:(S)-3-((R)-3-methoxyquinuclidin-3-yl)-1-phenyl-1-(pyridin-3-yl)prop-2-yn-1-ol | CHEMBL372566
TypeSmall organic molecule
Emp. Form.C22H24N2O2
Mol. Mass.348.4382
SMILESCO[C@@]1(CN2CCC1CC2)C#C[C@](O)(c1ccccc1)c1cccnc1