Reaction Details
TargetCysteine protease falcipain-3 [5-492]
LigandBDBM50183408
Substrate/Competitorn/a
Meas. Tech.ChEMBL_336665 (CHEMBL862348)
IC50 34000±n/a nM
Citation Desai, PVPatny, AGut, JRosenthal, PJTekwani, BSrivastava, AAvery, M Identification of novel parasitic cysteine protease inhibitors by use of virtual screening. 2. The available chemical directory. J Med Chem49:1576-84 (2006) 
 
Cysteine protease falcipain-3 [5-492]
Name:Cysteine protease falcipain-3 [5-492]
Type:PROTEIN
Mol. Mass.:56106.86
Organism:Plasmodium falciparum
Description:ChEMBL_430127
Residue:488
BDBM50183408
NameBDBM50183408
Synonyms:1-((1-(phenylsulfonyl)piperidin-4-yl)methyl)-3-tosylurea | CHEMBL379228
TypeSmall organic molecule
Emp. Form.C20H25N3O5S2
Mol. Mass.451.56
SMILESCc1ccc(cc1)S(=O)(=O)NC(=O)NCC1CCN(CC1)S(=O)(=O)c1ccccc1