Reaction Details
TargetGag-Pol polyprotein [489-587]
LigandBDBM4685
Substrate/Competitorn/a
Meas. Tech.ChEMBL_345068 (CHEMBL869622)
Ki 0.0000150±n/a nM
Citation Miller, JFAndrews, CWBrieger, MFurfine, ESHale, MRHanlon, MHHazen, RJKaldor, IMcLean, EWReynolds, DSammond, DMSpaltenstein, ATung, RTurner, EMXu, RXSherrill, RG Ultra-potent P1 modified arylsulfonamide HIV protease inhibitors: the discovery of GW0385. Bioorg Med Chem Lett16:1788-94 (2006) 
 
Gag-Pol polyprotein [489-587]
Name:Gag-Pol polyprotein [489-587]
Type:Enzyme Subunit
Mol. Mass.:10781.16
Organism:Human immunodeficiency virus type 1
Description:P04585[489-587]
Residue:99
BDBM4685
NameBDBM4685
Synonyms:(3R,3aS,6aR)-hexahydrofuro[2,3-b]furan-3-yl N-[(2S,3R)-4-[2H-1,3-benzodioxole-5-(2-methylpropyl)sulfonamido]-3-hydroxy-1-{4-[(2-methyl-1,3-thiazol-4-yl)methoxy]phenyl}butan-2-yl]carbamate GW0385 | [3H]GW0385
TypeSmall organic molecule
Emp. Form.C33H41N3O10S2
Mol. Mass.703.823
SMILES[H][C@]12OCC[C@@]1([H])[C@H](CO2)OC(=O)N[C@@H](Cc1ccc(OCc2csc(C)n2)cc1)[C@H](O)CN(CC(C)C)S(=O)(=O)c1ccc2OCOc2c1