Reaction Details
TargetNeuronal acetylcholine receptor subunit alpha-7
LigandBDBM50190686
Substrate/Competitorn/a
Meas. Tech.ChEMBL_369355 (CHEMBL870894)
Ki 4±n/a nM
Citation Tatsumi, RFujio, MTakanashi, SNumata, AKatayama, JSatoh, HShiigi, YMaeda, JKuriyama, MHorikawa, TMurozono, THashimoto, KTanaka, H (R)-3'-(3-methylbenzo[b]thiophen-5-yl)spiro[1-azabicyclo[2,2,2]octane-3,5'-oxazolidin]-2'-one, a novel and potent alpha7 nicotinic acetylcholine receptor partial agonist displays cognitive enhancing properties. J Med Chem49:4374-83 (2006) 
 
Neuronal acetylcholine receptor subunit alpha-7
Name:Neuronal acetylcholine receptor subunit alpha-7
Type:Enzyme
Mol. Mass.:56502.44
Organism:Rattus norvegicus (Rat)
Description:Q05941
Residue:502
BDBM50190686
NameBDBM50190686
Synonyms:(R)-3'-(2,3-dimethylbenzo[b]thiophen-5-yl)spiro[1-azabicyclo-[2.2.2]octane-3,5'-oxazolidin]-2'-one | CHEMBL213137
TypeSmall organic molecule
Emp. Form.C19H22N2O3
Mol. Mass.326.3896
SMILESCc1oc2ccc(cc2c1C)N1C[C@]2(CN3CCC2CC3)OC1=O