Reaction Details
TargetNeuronal acetylcholine receptor subunit alpha-7
LigandBDBM50190687
Substrate/Competitorn/a
Meas. Tech.ChEMBL_369355 (CHEMBL870894)
Ki 200±n/a nM
Citation Tatsumi, RFujio, MTakanashi, SNumata, AKatayama, JSatoh, HShiigi, YMaeda, JKuriyama, MHorikawa, TMurozono, THashimoto, KTanaka, H (R)-3'-(3-methylbenzo[b]thiophen-5-yl)spiro[1-azabicyclo[2,2,2]octane-3,5'-oxazolidin]-2'-one, a novel and potent alpha7 nicotinic acetylcholine receptor partial agonist displays cognitive enhancing properties. J Med Chem49:4374-83 (2006) 
 
Neuronal acetylcholine receptor subunit alpha-7
Name:Neuronal acetylcholine receptor subunit alpha-7
Type:Enzyme
Mol. Mass.:56502.44
Organism:Rattus norvegicus (Rat)
Description:Q05941
Residue:502
BDBM50190687
NameBDBM50190687
Synonyms:(R)-3'-(indan-5-yl)spiro[-1-azabicyclo[2.2.2]octane-3,5'-oxazolidin]-2'-one | CHEMBL377970
TypeSmall organic molecule
Emp. Form.C18H22N2O2
Mol. Mass.298.3795
SMILESO=C1O[C@]2(CN1c1ccc3CCCc3c1)CN1CCC2CC1