Reaction Details
TargetMu-type opioid receptor
LigandBDBM50188859
Substrate/Competitorn/a
Meas. Tech.ChEMBL_379381 (CHEMBL864838)
IC50 3851±n/a nM
Citation Alberati, DHainzl, DJolidon, SKurt, APinard, EThomas, AWZimmerli, D 4-Substituted-8-(1-phenyl-cyclohexyl)-2,8-diaza-spiro[4.5]decan-1-one as a novel class of highly selective GlyT1 inhibitors with superior pharmacological and pharmacokinetic parameters. Bioorg Med Chem Lett16:4321-5 (2006) 
 
Mu-type opioid receptor
Name:Mu-type opioid receptor
Type:G Protein-Coupled Receptor (GPCR)
Mol. Mass.:44789.51
Organism:Homo sapiens (Human)
Description:P35372
Residue:400
BDBM50188859
NameBDBM50188859
Synonyms:CHEMBL378665 | rac-4-(4-fluoro-phenyl)-8-(1-o-tolyl-cyclohexyl)-2,8-diaza-spiro[4.5]decan-1-one
TypeSmall organic molecule
Emp. Form.C27H33FN2O
Mol. Mass.420.5621
SMILESCc1ccccc1C1(CCCCC1)N1CCC2(CC1)C(CNC2=O)c1ccc(F)cc1