Reaction Details
TargetMu-type opioid receptor
LigandBDBM50188843
Substrate/Competitorn/a
Meas. Tech.ChEMBL_379381 (CHEMBL864838)
IC50 2760±n/a nM
Citation Alberati, DHainzl, DJolidon, SKurt, APinard, EThomas, AWZimmerli, D 4-Substituted-8-(1-phenyl-cyclohexyl)-2,8-diaza-spiro[4.5]decan-1-one as a novel class of highly selective GlyT1 inhibitors with superior pharmacological and pharmacokinetic parameters. Bioorg Med Chem Lett16:4321-5 (2006) 
 
Mu-type opioid receptor
Name:Mu-type opioid receptor
Type:G Protein-Coupled Receptor (GPCR)
Mol. Mass.:44789.51
Organism:Homo sapiens (Human)
Description:P35372
Residue:400
BDBM50188843
NameBDBM50188843
Synonyms:8-(1-phenyl-cyclohexyl)-4-propyl-2,8-diaza-spiro[4.5]decan-1-one CHEMBL540110 | rac-8-(1-phenyl-cyclohexyl)-4-propyl-2,8-diaza-spiro[4.5]decan-1-one
TypeSmall organic molecule
Emp. Form.C23H34N2O
Mol. Mass.354.5289
SMILESCCCC1CNC(=O)C11CCN(CC1)C1(CCCCC1)c1ccccc1