Reaction Details
TargetPotassium voltage-gated channel subfamily H member 2
LigandBDBM50188849
Substrate/Competitorn/a
Meas. Tech.ChEMBL_379391 (CHEMBL864852)
IC50 1300±n/a nM
Citation Alberati, DHainzl, DJolidon, SKurt, APinard, EThomas, AWZimmerli, D 4-Substituted-8-(1-phenyl-cyclohexyl)-2,8-diaza-spiro[4.5]decan-1-one as a novel class of highly selective GlyT1 inhibitors with superior pharmacological and pharmacokinetic parameters. Bioorg Med Chem Lett16:4321-5 (2006) 
 
Potassium voltage-gated channel subfamily H member 2
Name:Potassium voltage-gated channel subfamily H member 2
Type:Multi-pass membrane protein
Mol. Mass.:126672.65
Organism:Homo sapiens (Human)
Description:Q12809
Residue:1159
BDBM50188849
NameBDBM50188849
Synonyms:4-(4-fluoro-phenyl)-8-[1-(4-fluoro-phenyl)-cyclohexyl]-2,8-diaza-spiro[4.5]decan-1-one CHEMBL534940
TypeSmall organic molecule
Emp. Form.C26H30F2N2O
Mol. Mass.424.526
SMILESFc1ccc(cc1)C1CNC(=O)C11CCN(CC1)C1(CCCCC1)c1ccc(F)cc1