Reaction Details
TargetNociceptin receptor
LigandBDBM50188855
Substrate/Competitorn/a
Meas. Tech.ChEMBL_379380 (CHEMBL864837)
IC50 15±n/a nM
Citation Alberati, DHainzl, DJolidon, SKurt, APinard, EThomas, AWZimmerli, D 4-Substituted-8-(1-phenyl-cyclohexyl)-2,8-diaza-spiro[4.5]decan-1-one as a novel class of highly selective GlyT1 inhibitors with superior pharmacological and pharmacokinetic parameters. Bioorg Med Chem Lett16:4321-5 (2006) 
 
Nociceptin receptor
Name:Nociceptin receptor
Type:G Protein-Coupled Receptor (GPCR)
Mol. Mass.:40702.87
Organism:Homo sapiens (Human)
Description:P41146
Residue:370
BDBM50188855
NameBDBM50188855
Synonyms:1-phenyl-8-(1-phenyl-cyclohexyl)-1,3,8-triaza-spiro[4.5]decan-4-one | CHEMBL403515
TypeSmall organic molecule
Emp. Form.C25H31N3O
Mol. Mass.389.5331
SMILESO=C1NCN(c2ccccc2)C11CCN(CC1)C1(CCCCC1)c1ccccc1