Reaction Details
TargetRNA-directed RNA polymerase
LigandBDBM50199043
Substrate/Competitorn/a
Meas. Tech.ChEMBL_411597 (CHEMBL907248)
IC50 19±n/a nM
Citation Ikegashira, KOka, THirashima, SNoji, SYamanaka, HHara, YAdachi, TTsuruha, JDoi, SHase, YNoguchi, TAndo, IOgura, NIkeda, SHashimoto, H Discovery of conformationally constrained tetracyclic compounds as potent hepatitis C virus NS5B RNA polymerase inhibitors. J Med Chem49:6950-3 (2006) 
 
RNA-directed RNA polymerase
Name:RNA-directed RNA polymerase
Type:Protein
Mol. Mass.:25173.95
Organism:Hepatitis C virus
Description:Q8JXU8
Residue:229
BDBM50199043
NameBDBM50199043
Synonyms:13-cyclohexyl-5-methyl-6,7-dihydro-5H-benzo[5,6][1,4]diazepino[7,1-a]indole-10-carboxylicacid | CHEMBL215056
TypeSmall organic molecule
Emp. Form.C24H26N2O2
Mol. Mass.374.4754
SMILESCN1CCn2c(c(C3CCCCC3)c3ccc(cc23)C(O)=O)-c2ccccc12