Reaction Details
TargetRNA-directed RNA polymerase
LigandBDBM50199051
Substrate/Competitorn/a
Meas. Tech.ChEMBL_411597 (CHEMBL907248)
IC50 17±n/a nM
Citation Ikegashira, KOka, THirashima, SNoji, SYamanaka, HHara, YAdachi, TTsuruha, JDoi, SHase, YNoguchi, TAndo, IOgura, NIkeda, SHashimoto, H Discovery of conformationally constrained tetracyclic compounds as potent hepatitis C virus NS5B RNA polymerase inhibitors. J Med Chem49:6950-3 (2006) 
 
RNA-directed RNA polymerase
Name:RNA-directed RNA polymerase
Type:Protein
Mol. Mass.:25173.95
Organism:Hepatitis C virus
Description:Q8JXU8
Residue:229
BDBM50199051
NameBDBM50199051
Synonyms:3-benzyloxy-12-cyclohexyl-6,7-dihydro-5-oxa-7a-azadibenzo[a,e]azulene-9-carboxylic acid | CHEMBL386319
TypeSmall organic molecule
Emp. Form.C30H29NO4
Mol. Mass.467.5556
SMILESOC(=O)c1ccc2c(C3CCCCC3)c3-c4ccc(OCc5ccccc5)cc4OCCn3c2c1