Reaction Details
TargetRNA-directed RNA polymerase
LigandBDBM50199046
Substrate/Competitorn/a
Meas. Tech.ChEMBL_411597 (CHEMBL907248)
IC50 26±n/a nM
Citation Ikegashira, KOka, THirashima, SNoji, SYamanaka, HHara, YAdachi, TTsuruha, JDoi, SHase, YNoguchi, TAndo, IOgura, NIkeda, SHashimoto, H Discovery of conformationally constrained tetracyclic compounds as potent hepatitis C virus NS5B RNA polymerase inhibitors. J Med Chem49:6950-3 (2006) 
 
RNA-directed RNA polymerase
Name:RNA-directed RNA polymerase
Type:Protein
Mol. Mass.:25173.95
Organism:Hepatitis C virus
Description:Q8JXU8
Residue:229
BDBM50199046
NameBDBM50199046
Synonyms:13-cyclohexyl-5-(2-phenylethyl)-6,7-dihydro-5H-benzo[5,6][1,4]diazepino[7,1-a]indole-10-carboxylic acid hydrochlor ide | CHEMBL216865
TypeSmall organic molecule
Emp. Form.C31H32N2O2
Mol. Mass.464.598
SMILESOC(=O)c1ccc2c(C3CCCCC3)c3-c4ccccc4N(CCc4ccccc4)CCn3c2c1