Reaction Details
TargetC-X-C chemokine receptor type 2
LigandBDBM50200876
Substrate/Competitorn/a
Meas. Tech.ChEMBL_422684 (CHEMBL909848)
IC50 244±n/a nM
Citation Dwyer, MPYu, YChao, JAki, CChao, JBiju, PGirijavallabhan, VRindgen, DBond, RMayer-Ezel, RJakway, JHipkin, RWFossetta, JGonsiorek, WBian, HFan, XTerminelli, CFine, JLundell, DMerritt, JRRokosz, LLKaiser, BLi, GWang, WStauffer, TOzgur, LBaldwin, JTaveras, AG Discovery of 2-hydroxy-N,N-dimethyl-3-{2-[[(R)-1-(5- methylfuran-2-yl)propyl]amino]-3,4-dioxocyclobut-1-enylamino}benzamide (SCH 527123): a potent, orally bioavailable CXCR2/CXCR1 receptor antagonist. J Med Chem49:7603-6 (2006) 
 
C-X-C chemokine receptor type 2
Name:C-X-C chemokine receptor type 2
Type:Protein
Mol. Mass.:40767.88
Organism:Homo sapiens (Human)
Description:P25025
Residue:360
BDBM50200876
NameBDBM50200876
Synonyms:(S)-3-(3,4-dioxo-2-(1-phenylethylamino)cyclobut-1-enylamino)-2-hydroxy-N,N-dimethylbenzamide | CHEMBL219472
TypeSmall organic molecule
Emp. Form.C21H21N3O4
Mol. Mass.379.4091
SMILESC[C@H](Nc1c(Nc2cccc(C(=O)N(C)C)c2O)c(=O)c1=O)c1ccccc1