Reaction Details
TargetProgesterone receptor
LigandBDBM50201100
Substrate/Competitorn/a
Meas. Tech.ChEMBL_423017 (CHEMBL909350)
IC50 90±n/a nM
Citation Regan, JLee, TWZindell, RMBekkali, YBentzien, JGilmore, THammach, AKirrane, TMKukulka, AJKuzmich, DNelson, RMProudfoot, JRRalph, MPelletier, JSouza, DZuvela-Jelaska, LNabozny, GThomson, DS Quinol-4-ones as steroid A-ring mimetics in nonsteroidal dissociated glucocorticoid agonists. J Med Chem49:7887-96 (2006) 
 
Progesterone receptor
Name:Progesterone receptor
Type:Protein
Mol. Mass.:98979.52
Organism:Homo sapiens (Human)
Description:P06401
Residue:933
BDBM50201100
NameBDBM50201100
Synonyms:1-[4-(5-fluoro-2-methoxyphenyl)-2-hydroxy-4-methyl-2-(trifluoromethyl)pentyl]-2,3-dihydro-1H-quinolin-4-one | CHEMBL219314
TypeSmall organic molecule
Emp. Form.C23H25F4NO3
Mol. Mass.439.4431
SMILESCOc1ccc(F)cc1C(C)(C)CC(O)(CN1CCC(=O)c2ccccc12)C(F)(F)F