Reaction Details
TargetEgl nine homolog 1
LigandBDBM50193145
Substrate/Competitorn/a
Meas. Tech.ChEMBL_424035 (CHEMBL855663)
IC50 1400±n/a nM
Citation Warshakoon, NCWu, SBoyer, AKawamoto, RRenock, SXu, KPokross, MEvdokimov, AGZhou, SWinter, CWalter, RMekel, M Design and synthesis of a series of novel pyrazolopyridines as HIF-1alpha prolyl hydroxylase inhibitors. Bioorg Med Chem Lett16:5687-90 (2006) 
 
Egl nine homolog 1
Name:Egl nine homolog 1
Type:Protein
Mol. Mass.:46035.59
Organism:Homo sapiens (Human)
Description:Q9GZT9
Residue:426
BDBM50193145
NameBDBM50193145
Synonyms:2-(1-chloro-4-hydroxyisoquinoline-3-carboxamido)acetic acid Isoquinoline 3 | N-[(1-CHLORO-4-HYDROXYISOQUINOLIN-3-YL)CARBONYL]GLYCINE
TypeSmall organic molecule
Emp. Form.C12H9ClN2O4
Mol. Mass.280.664
SMILESOC(=O)CNC(=O)c1nc(Cl)c2ccccc2c1O