Reaction Details
TargetPotassium voltage-gated channel subfamily H member 2
LigandBDBM50193840
Substrate/Competitorn/a
Meas. Tech.ChEMBL_424194 (CHEMBL907268)
Ki>10000±n/a nM
Citation Zhu, BYJia, ZJZhang, PSu, THuang, WGoldman, ETumas, DKadambi, VEddy, PSinha, UScarborough, RMSong, Y Inhibitory effect of carboxylic acid group on hERG binding. Bioorg Med Chem Lett16:5507-12 (2006) 
 
Potassium voltage-gated channel subfamily H member 2
Name:Potassium voltage-gated channel subfamily H member 2
Type:Multi-pass membrane protein
Mol. Mass.:126672.65
Organism:Homo sapiens (Human)
Description:Q12809
Residue:1159
BDBM50193840
NameBDBM50193840
Synonyms:1-(2-(4-chloro-2-(5-chloropyridin-2-ylcarbamoyl)phenylcarbamoyl)-5-(N,N-dimethylcarbamimidoyl)phenyl)piperidine-4-carboxylic acid CHEMBL221956
TypeSmall organic molecule
Emp. Form.C28H28Cl2N6O4
Mol. Mass.583.466
SMILESCN(C)C(=N)c1ccc(C(=O)Nc2ccc(Cl)cc2C(=O)Nc2ccc(Cl)cn2)c(c1)N1CCC(CC1)C(O)=O