Reaction Details
TargetPotassium voltage-gated channel subfamily H member 2
LigandBDBM50193861
Substrate/Competitorn/a
Meas. Tech.ChEMBL_424194 (CHEMBL907268)
Ki 100±n/a nM
Citation Zhu, BYJia, ZJZhang, PSu, THuang, WGoldman, ETumas, DKadambi, VEddy, PSinha, UScarborough, RMSong, Y Inhibitory effect of carboxylic acid group on hERG binding. Bioorg Med Chem Lett16:5507-12 (2006) 
 
Potassium voltage-gated channel subfamily H member 2
Name:Potassium voltage-gated channel subfamily H member 2
Type:Multi-pass membrane protein
Mol. Mass.:126672.65
Organism:Homo sapiens (Human)
Description:Q12809
Residue:1159
BDBM50193861
NameBDBM50193861
Synonyms:5-chloro-N-(5-chloro-pyridin-2-yl)-2-[4-(N,N-dimethyl-carbamimidoyl)-benzoylamino]-benzamide CHEMBL221906
TypeSmall organic molecule
Emp. Form.C22H19Cl2N5O2
Mol. Mass.456.325
SMILESCN(C)C(=N)c1ccc(cc1)C(=O)Nc1ccc(Cl)cc1C(=O)Nc1ccc(Cl)cn1