Reaction Details
TargetThromboxane A2 receptor
LigandBDBM50193924
Substrate/Competitorn/a
Meas. Tech.ChEMBL_424244 (CHEMBL909018)
Ki>500±n/a nM
Citation Belley, MChan, CCGareau, YGallant, MJuteau, HHoude, KLachance, NLabelle, MSawyer, NTremblay, NLamontagne, SCarrière, MCDenis, DGreig, GMSlipetz, DGordon, RChauret, NLi, CZamboni, RJMetters, KM Comparison between two classes of selective EP(3) antagonists and their biological activities. Bioorg Med Chem Lett16:5639-42 (2006) 
 
Thromboxane A2 receptor
Name:Thromboxane A2 receptor
Type:Enyzme
Mol. Mass.:37445.28
Organism:Homo sapiens (Human)
Description:P21731
Residue:343
BDBM50193924
NameBDBM50193924
Synonyms:3-(2-((6-(benzyloxy)naphthalen-2-yl)methyl)phenyl)acrylic acid | CHEMBL218263
TypeSmall organic molecule
Emp. Form.C27H22O3
Mol. Mass.394.4618
SMILESOC(=O)\C=C\c1ccccc1Cc1ccc2cc(OCc3ccccc3)ccc2c1