Reaction Details
TargetProstaglandin D2 receptor
LigandBDBM50193926
Substrate/Competitorn/a
Meas. Tech.ChEMBL_424246 (CHEMBL909020)
Ki>500±n/a nM
Citation Belley, MChan, CCGareau, YGallant, MJuteau, HHoude, KLachance, NLabelle, MSawyer, NTremblay, NLamontagne, SCarrière, MCDenis, DGreig, GMSlipetz, DGordon, RChauret, NLi, CZamboni, RJMetters, KM Comparison between two classes of selective EP(3) antagonists and their biological activities. Bioorg Med Chem Lett16:5639-42 (2006) 
 
Prostaglandin D2 receptor
Name:Prostaglandin D2 receptor
Type:Enzyme
Mol. Mass.:40288.87
Organism:Homo sapiens (Human)
Description:Q13258
Residue:359
BDBM50193926
NameBDBM50193926
Synonyms:3-(2-(2-(2,6-dichlorobenzyloxy)-5-methylcinnamyl)phenyl)acrylic acid | CHEMBL217988
TypeSmall organic molecule
Emp. Form.C26H22Cl2O3
Mol. Mass.453.357
SMILESCc1ccc(OCc2c(Cl)cccc2Cl)c(\C=C\Cc2ccccc2\C=C\C(O)=O)c1