Reaction Details
TargetProstaglandin E2 receptor EP3 subtype
LigandBDBM50193934
Substrate/Competitorn/a
Meas. Tech.ChEMBL_424228 (CHEMBL909002)
Ki 68±n/a nM
Citation Belley, MChan, CCGareau, YGallant, MJuteau, HHoude, KLachance, NLabelle, MSawyer, NTremblay, NLamontagne, SCarrière, MCDenis, DGreig, GMSlipetz, DGordon, RChauret, NLi, CZamboni, RJMetters, KM Comparison between two classes of selective EP(3) antagonists and their biological activities. Bioorg Med Chem Lett16:5639-42 (2006) 
 
Prostaglandin E2 receptor EP3 subtype
Name:Prostaglandin E2 receptor EP3 subtype
Type:Enzyme
Mol. Mass.:43335.03
Organism:Homo sapiens (Human)
Description:P43115
Residue:390
BDBM50193934
NameBDBM50193934
Synonyms:3-(2-(4-methoxycinnamyl)phenyl)acrylic acid | CHEMBL219590
TypeSmall organic molecule
Emp. Form.C19H18O3
Mol. Mass.294.3444
SMILESCOc1ccc(\C=C\Cc2ccccc2\C=C\C(O)=O)cc1