Reaction Details
TargetProstaglandin E2 receptor EP1 subtype
LigandBDBM50193935
Substrate/Competitorn/a
Meas. Tech.ChEMBL_424226 (CHEMBL909000)
Ki>100000±n/a nM
Citation Belley, MChan, CCGareau, YGallant, MJuteau, HHoude, KLachance, NLabelle, MSawyer, NTremblay, NLamontagne, SCarrière, MCDenis, DGreig, GMSlipetz, DGordon, RChauret, NLi, CZamboni, RJMetters, KM Comparison between two classes of selective EP(3) antagonists and their biological activities. Bioorg Med Chem Lett16:5639-42 (2006) 
 
Prostaglandin E2 receptor EP1 subtype
Name:Prostaglandin E2 receptor EP1 subtype
Type:Enzyme
Mol. Mass.:41834.57
Organism:Homo sapiens (Human)
Description:P34995
Residue:402
BDBM50193935
NameBDBM50193935
Synonyms:3-(2-((6-(benzyloxy)naphthalen-2-yl)methyl)phenyl)-N-(5-bromo-2-methoxyphenylsulfonyl)acrylamide | CHEMBL217941
TypeSmall organic molecule
Emp. Form.C34H28BrNO5S
Mol. Mass.642.559
SMILESCOc1ccc(Br)cc1S(=O)(=O)NC(=O)\C=C\c1ccccc1Cc1ccc2cc(OCc3ccccc3)ccc2c1