Reaction Details
TargetProstaglandin E2 receptor EP4 subtype
LigandBDBM50193935
Substrate/Competitorn/a
Meas. Tech.ChEMBL_424229 (CHEMBL909003)
Ki 8000±n/a nM
Citation Belley, MChan, CCGareau, YGallant, MJuteau, HHoude, KLachance, NLabelle, MSawyer, NTremblay, NLamontagne, SCarrière, MCDenis, DGreig, GMSlipetz, DGordon, RChauret, NLi, CZamboni, RJMetters, KM Comparison between two classes of selective EP(3) antagonists and their biological activities. Bioorg Med Chem Lett16:5639-42 (2006) 
 
Prostaglandin E2 receptor EP4 subtype
Name:Prostaglandin E2 receptor EP4 subtype
Type:Enzyme
Mol. Mass.:53134.53
Organism:Homo sapiens (Human)
Description:P35408
Residue:488
BDBM50193935
NameBDBM50193935
Synonyms:3-(2-((6-(benzyloxy)naphthalen-2-yl)methyl)phenyl)-N-(5-bromo-2-methoxyphenylsulfonyl)acrylamide | CHEMBL217941
TypeSmall organic molecule
Emp. Form.C34H28BrNO5S
Mol. Mass.642.559
SMILESCOc1ccc(Br)cc1S(=O)(=O)NC(=O)\C=C\c1ccccc1Cc1ccc2cc(OCc3ccccc3)ccc2c1