Reaction Details
TargetProstaglandin E2 receptor EP1 subtype
LigandBDBM50193920
Substrate/Competitorn/a
Meas. Tech.ChEMBL_424226 (CHEMBL909000)
Ki 3200±n/a nM
Citation Belley, MChan, CCGareau, YGallant, MJuteau, HHoude, KLachance, NLabelle, MSawyer, NTremblay, NLamontagne, SCarrière, MCDenis, DGreig, GMSlipetz, DGordon, RChauret, NLi, CZamboni, RJMetters, KM Comparison between two classes of selective EP(3) antagonists and their biological activities. Bioorg Med Chem Lett16:5639-42 (2006) 
 
Prostaglandin E2 receptor EP1 subtype
Name:Prostaglandin E2 receptor EP1 subtype
Type:Enzyme
Mol. Mass.:41834.57
Organism:Homo sapiens (Human)
Description:P34995
Residue:402
BDBM50193920
NameBDBM50193920
Synonyms:3-(2-((6-(benzyloxy)naphthalen-2-yl)methyl)phenyl)-N-(thiophen-2-ylsulfonyl)acrylamide | CHEMBL217991
TypeSmall organic molecule
Emp. Form.C31H25NO4S2
Mol. Mass.539.665
SMILESO=C(NS(=O)(=O)c1cccs1)\C=C\c1ccccc1Cc1ccc2cc(OCc3ccccc3)ccc2c1