Reaction Details
TargetProstaglandin E2 receptor EP3 subtype
LigandBDBM50193922
Substrate/Competitorn/a
Meas. Tech.ChEMBL_424247 (CHEMBL909021)
Ki 6.90±n/a nM
Citation Belley, MChan, CCGareau, YGallant, MJuteau, HHoude, KLachance, NLabelle, MSawyer, NTremblay, NLamontagne, SCarrière, MCDenis, DGreig, GMSlipetz, DGordon, RChauret, NLi, CZamboni, RJMetters, KM Comparison between two classes of selective EP(3) antagonists and their biological activities. Bioorg Med Chem Lett16:5639-42 (2006) 
 
Prostaglandin E2 receptor EP3 subtype
Name:Prostaglandin E2 receptor EP3 subtype
Type:Enzyme
Mol. Mass.:43335.03
Organism:Homo sapiens (Human)
Description:P43115
Residue:390
BDBM50193922
NameBDBM50193922
Synonyms:CHEMBL218071 | N-(5-bromo-2-methoxyphenylsulfonyl)-3-(2-(naphthalen-2-ylmethyl)phenyl)acrylamide
TypeSmall organic molecule
Emp. Form.C27H22BrNO4S
Mol. Mass.536.437
SMILESCOc1ccc(Br)cc1S(=O)(=O)NC(=O)\C=C\c1ccccc1Cc1ccc2ccccc2c1