Reaction Details
TargetCystathionine beta-lyase MetC
LigandBDBM50370851
Substrate/Competitorn/a
Meas. Tech.ChEMBL_425863 (CHEMBL856866)
IC50 60000±n/a nM
Citation Ejim, LJBlanchard, JEKoteva, KPSumerfield, RElowe, NHChechetto, JDBrown, EDJunop, MSWright, GD Inhibitors of bacterial cystathionine beta-lyase: leads for new antimicrobial agents and probes of enzyme structure and function. J Med Chem50:755-64 (2007) 
 
Cystathionine beta-lyase MetC
Name:Cystathionine beta-lyase MetC
Type:PROTEIN
Mol. Mass.:43211.38
Organism:Escherichia coli K-12
Description:ChEMBL_425863
Residue:395
BDBM50370851
NameBDBM50370851
Synonyms:CHEMBL375564
TypeSmall organic molecule
Emp. Form.C11H15N3O4
Mol. Mass.253.2545
SMILESCOc1cccc(OC)c1C(=O)NCC(=O)NN