Reaction Details
TargetCystathionine beta-lyase MetC
LigandBDBM50370855
Substrate/Competitorn/a
Meas. Tech.ChEMBL_425863 (CHEMBL856866)
IC50 4500±n/a nM
Citation Ejim, LJBlanchard, JEKoteva, KPSumerfield, RElowe, NHChechetto, JDBrown, EDJunop, MSWright, GD Inhibitors of bacterial cystathionine beta-lyase: leads for new antimicrobial agents and probes of enzyme structure and function. J Med Chem50:755-64 (2007) 
 
Cystathionine beta-lyase MetC
Name:Cystathionine beta-lyase MetC
Type:PROTEIN
Mol. Mass.:43211.38
Organism:Escherichia coli K-12
Description:ChEMBL_425863
Residue:395
BDBM50370855
NameBDBM50370855
Synonyms:CHEMBL218737
TypeSmall organic molecule
Emp. Form.C9H10N4O4
Mol. Mass.238.2001
SMILESNNC(=O)CNC(=O)c1ccccc1[N+]([O-])=O