Reaction Details
TargetTyrosine-protein kinase Fyn
LigandBDBM50133496
Substrate/Competitorn/a
Meas. Tech.ChEMBL_428426 (CHEMBL919495)
IC50 1300±n/a nM
Citation Jelic, DMildner, BKostrun, SNujic, KVerbanac, DCulic, OAntolovic, RBrandt, W Homology modeling of human Fyn kinase structure: discovery of rosmarinic acid as a new Fyn kinase inhibitor and in silico study of its possible binding modes. J Med Chem50:1090-100 (2007) 
 
Tyrosine-protein kinase Fyn
Name:Tyrosine-protein kinase Fyn
Type:Enzyme
Mol. Mass.:60762.21
Organism:Homo sapiens (Human)
Description:P06241
Residue:537
BDBM50133496
NameBDBM50133496
Synonyms:(2R)-3-(3,4-dihydroxyphenyl)-2-[(2E)-3-(3,4-dihydroxyphenyl)prop-2-enoyloxy]propanoic acid CHEMBL324842 US10688093, Compound rosmarinic acid cid_5281792
TypeSmall organic molecule
Emp. Form.C18H16O8
Mol. Mass.360.3148
SMILESOC(=O)[C@@H](Cc1ccc(O)c(O)c1)OC(=O)\C=C\c1ccc(O)c(O)c1