Reaction Details
TargetCysteine protease
LigandBDBM50157736
Substrate/Competitorn/a
Meas. Tech.ChEMBL_430130 (CHEMBL919608)
IC50 112900±n/a nM
Citation Desai, PVPatny, ASabnis, YTekwani, BGut, JRosenthal, PSrivastava, AAvery, M Identification of novel parasitic cysteine protease inhibitors using virtual screening. 1. The ChemBridge database. J Med Chem47:6609-15 (2004) 
 
Cysteine protease
Name:Cysteine protease
Synonyms:n/a
Type:PROTEIN
Mol. Mass.:42630.50
Organism:Leishmania donovani
Description:ChEMBL_430130
Residue:394
BDBM50157736
NameBDBM50157736
TypeSmall organic molecule
Emp. Form.C24H18N2O4
Mol. Mass.398.4107
SMILESOc1cccc(\C=N\c2cccc3c(cccc23)\N=C/c2cccc(O)c2O)c1O