Reaction Details
TargetCysteine protease falcipain-3 [5-492]
LigandBDBM50157754
Substrate/Competitorn/a
Meas. Tech.ChEMBL_430127 (CHEMBL919605)
IC50 12000±n/a nM
Citation Desai, PVPatny, ASabnis, YTekwani, BGut, JRosenthal, PSrivastava, AAvery, M Identification of novel parasitic cysteine protease inhibitors using virtual screening. 1. The ChemBridge database. J Med Chem47:6609-15 (2004) 
 
Cysteine protease falcipain-3 [5-492]
Name:Cysteine protease falcipain-3 [5-492]
Type:PROTEIN
Mol. Mass.:56106.86
Organism:Plasmodium falciparum
Description:ChEMBL_430127
Residue:488
BDBM50157754
NameBDBM50157754
Synonyms:CHEMBL436500 | methyl 2-(2-(2-(4,6-dimethylpyrimidin-2-ylthio)acetoxy)acetamido)benzoate
TypeSmall organic molecule
Emp. Form.C18H19N3O5S
Mol. Mass.389.426
SMILESCOC(=O)c1ccccc1NC(=O)COC(=O)CSc1nc(C)cc(C)n1