Reaction Details
TargetVascular endothelial growth factor receptor 2
LigandBDBM4865
Substrate/Competitorn/a
Meas. Tech.ChEMBL_438434 (CHEMBL887535)
IC50 1400±n/a nM
Citation Yu, HWang, ZZhang, LZhang, JHuang, Q Pharmacophore modeling and in silico screening for new KDR kinase inhibitors. Bioorg Med Chem Lett17:2126-33 (2007) 
 
Vascular endothelial growth factor receptor 2
Name:Vascular endothelial growth factor receptor 2
Type:Receptor Tyrosine Kinase
Mol. Mass.:151510.97
Organism:Homo sapiens (Human)
Description:P35968
Residue:1356
BDBM4865
NameBDBM4865
Synonyms:4-(4-Chloroanilino)-1-(4-pyridylmethyl)pyrido[3,4-d]-pyridazine CHEMBL433321 | N-(4-chlorophenyl)-1-(pyridin-4-ylmethyl)pyrido[3,4-d]pyridazin-4-amine
TypeSmall organic molecule
Emp. Form.C19H14ClN5
Mol. Mass.347.801
SMILESClc1ccc(Nc2nnc(Cc3ccncc3)c3ccncc23)cc1