Reaction Details
TargetVascular endothelial growth factor receptor 2
LigandBDBM4877
Substrate/Competitorn/a
Meas. Tech.ChEMBL_438434 (CHEMBL887535)
IC50 140±n/a nM
Citation Yu, HWang, ZZhang, LZhang, JHuang, Q Pharmacophore modeling and in silico screening for new KDR kinase inhibitors. Bioorg Med Chem Lett17:2126-33 (2007) 
 
Vascular endothelial growth factor receptor 2
Name:Vascular endothelial growth factor receptor 2
Type:Receptor Tyrosine Kinase
Mol. Mass.:151510.97
Organism:Homo sapiens (Human)
Description:P35968
Residue:1356
BDBM4877
NameBDBM4877
Synonyms:1-(3-Methoxy-4-chloroanilino)-4-(4-pyridylmethyl)-phthalazine CHEMBL75034 | N-(4-chloro-3-methoxyphenyl)-4-(pyridin-4-ylmethyl)phthalazin-1-amine
TypeSmall organic molecule
Emp. Form.C21H17ClN4O
Mol. Mass.376.839
SMILESCOc1cc(Nc2nnc(Cc3ccncc3)c3ccccc23)ccc1Cl