Reaction Details
TargetBeta-2 adrenergic receptor
LigandBDBM50212728
Substrate/Competitorn/a
Meas. Tech.ChEMBL_438806 (CHEMBL889143)
EC50 0.020000±n/a nM
Citation Brown, ADBunnage, MEGlossop, PAJames, KJones, RLane, CALewthwaite, RAMantell, SPerros-Huguet, CPrice, DATrevethick, MWebster, R The discovery of long acting beta2-adrenoreceptor agonists. Bioorg Med Chem Lett17:4012-5 (2007) 
 
Beta-2 adrenergic receptor
Name:Beta-2 adrenergic receptor
Type:n/a
Mol. Mass.:46461.69
Organism:Homo sapiens (Human)
Description:P07550
Residue:413
BDBM50212728
NameBDBM50212728
Synonyms:(R)-N-benzyl-2-(3-(2-(2-hydroxy-2-(4-hydroxy-3-(hydroxymethyl)phenyl)ethylamino)-2-methylpropyl)phenyl)acetamide | CHEMBL230486
TypeSmall organic molecule
Emp. Form.C28H34N2O4
Mol. Mass.462.5806
SMILESCC(C)(Cc1cccc(CC(=O)NCc2ccccc2)c1)NC[C@H](O)c1ccc(O)c(CO)c1