Reaction Details
TargetCarbonic anhydrase 14
LigandBDBM12934
Substrate/Competitorn/a
Meas. Tech.ChEMBL_441220 (CHEMBL891444)
Ki 94±n/a nM
Citation Wilkinson, BLBornaghi, LFHouston, TAInnocenti, AVullo, DSupuran, CTPoulsen, SA Inhibition of membrane-associated carbonic anhydrase isozymes IX, XII and XIV with a library of glycoconjugate benzenesulfonamides. Bioorg Med Chem Lett17:987-92 (2007) 
 
Carbonic anhydrase 14
Name:Carbonic anhydrase 14
Type:Enzyme
Mol. Mass.:37665.67
Organism:Homo sapiens (Human)
Description:Human (cloned) isozyme.
Residue:337
BDBM12934
NameBDBM12934
Synonyms:4-({[4-(Aminosulfonyl)benzoyl]amino}methyl-1-(2,3,4-tri-O-acetyl-beta-D-glucuronic acid methyl ester)-1H-1,2,3-triazole Glycoconjugate Benzene Sulfonamide 2e | methyl (2S,3S,4S,5R,6R)-3,4,5-tris(acetyloxy)-6-(4-{[(4-sulfamoylphenyl)formamido]methyl}-1H-1,2,3-triazol-1-yl)oxane-2-carboxylate
TypeSmall organic molecule
Emp. Form.C23H27N5O12S
Mol. Mass.597.552
SMILESCOC(=O)[C@H]1O[C@H]([C@H](OC(C)=O)[C@@H](OC(C)=O)[C@@H]1OC(C)=O)n1cc(CNC(=O)c2ccc(cc2)S(N)(=O)=O)nn1