Reaction Details
TargetCarbonic anhydrase 12
LigandBDBM50200448
Substrate/Competitorn/a
Meas. Tech.ChEMBL_441219 (CHEMBL891443)
Ki 11.5±n/a nM
Citation Wilkinson, BLBornaghi, LFHouston, TAInnocenti, AVullo, DSupuran, CTPoulsen, SA Inhibition of membrane-associated carbonic anhydrase isozymes IX, XII and XIV with a library of glycoconjugate benzenesulfonamides. Bioorg Med Chem Lett17:987-92 (2007) 
 
Carbonic anhydrase 12
Name:Carbonic anhydrase 12
Type:Enzyme
Mol. Mass.:39456.00
Organism:Homo sapiens (Human)
Description:Catalytic domain of human cloned isozyme was used in the assay
Residue:354
BDBM50200448
NameBDBM50200448
Synonyms:4-sulfamoyl-N-[1-((2S,3S,4R,5R)-3,4,5-trihydroxy-tetrahydro-pyran-2-yl)-1H-[1,2,3]triazol-4-ylmethyl]-benzamide | CHEMBL231896
TypeSmall organic molecule
Emp. Form.C15H19N5O7S
Mol. Mass.413.406
SMILESNS(=O)(=O)c1ccc(cc1)C(=O)NCc1cn(nn1)[C@H]1OC[C@@H](O)[C@@H](O)[C@@H]1O