Reaction Details
TargetCarbonic anhydrase 14
LigandBDBM12935
Substrate/Competitorn/a
Meas. Tech.ChEMBL_441220 (CHEMBL891444)
Ki 105±n/a nM
Citation Wilkinson, BLBornaghi, LFHouston, TAInnocenti, AVullo, DSupuran, CTPoulsen, SA Inhibition of membrane-associated carbonic anhydrase isozymes IX, XII and XIV with a library of glycoconjugate benzenesulfonamides. Bioorg Med Chem Lett17:987-92 (2007) 
 
Carbonic anhydrase 14
Name:Carbonic anhydrase 14
Type:Enzyme
Mol. Mass.:37665.67
Organism:Homo sapiens (Human)
Description:Human (cloned) isozyme.
Residue:337
BDBM12935
NameBDBM12935
Synonyms:4-({[4-(Aminosulfonyl)benzoyl]amino}methyl-1-(beta-D-glucuronic acid methyl ester)-1H-1,2,3-triazole Glycoconjugate Benzene Sulfonamide 2ee | methyl (2S,3S,4S,5R,6R)-3,4,5-trihydroxy-6-(4-{[(4-sulfamoylphenyl)formamido]methyl}-1H-1,2,3-triazol-1-yl)oxane-2-carboxylate
TypeSmall organic molecule
Emp. Form.C17H21N5O9S
Mol. Mass.471.442
SMILESCOC(=O)[C@H]1O[C@H]([C@H](O)[C@@H](O)[C@@H]1O)n1cc(CNC(=O)c2ccc(cc2)S(N)(=O)=O)nn1