Reaction Details
TargetCarbonic anhydrase 14
LigandBDBM12940
Substrate/Competitorn/a
Meas. Tech.ChEMBL_441220 (CHEMBL891444)
Ki 73±n/a nM
Citation Wilkinson, BLBornaghi, LFHouston, TAInnocenti, AVullo, DSupuran, CTPoulsen, SA Inhibition of membrane-associated carbonic anhydrase isozymes IX, XII and XIV with a library of glycoconjugate benzenesulfonamides. Bioorg Med Chem Lett17:987-92 (2007) 
 
Carbonic anhydrase 14
Name:Carbonic anhydrase 14
Type:Enzyme
Mol. Mass.:37665.67
Organism:Homo sapiens (Human)
Description:Human (cloned) isozyme.
Residue:337
BDBM12940
NameBDBM12940
Synonyms:4-({[4-(Aminosulfonyl)benzoyl]oxy}methyl-1-(hepta-O-acetyl-beta-D-maltosyl)-1H-1,2,3-triazole Glycoconjugate Benzene Sulfonamide 3f | {1-[(2R,3R,4S,5R,6R)-3,4-bis(acetyloxy)-6-[(acetyloxy)methyl]-5-{[(2R,3R,4S,5R,6R)-3,4,5-tris(acetyloxy)-6-[(acetyloxy)methyl]oxan-2-yl]oxy}oxan-2-yl]-1H-1,2,3-triazol-4-yl}methyl 4-sulfamoylbenzoate
TypeSmall organic molecule
Emp. Form.C36H44N4O21S
Mol. Mass.900.814
SMILESCC(=O)OC[C@H]1O[C@H]([C@H](OC(C)=O)[C@@H](OC(C)=O)[C@@H]1O[C@H]1O[C@H](COC(C)=O)[C@@H](OC(C)=O)[C@H](OC(C)=O)[C@H]1OC(C)=O)n1cc(COC(=O)c2ccc(cc2)S(N)(=O)=O)nn1