Reaction Details
TargetCarbonic anhydrase 12
LigandBDBM12945
Substrate/Competitorn/a
Meas. Tech.ChEMBL_441219 (CHEMBL891443)
Ki 7.3±n/a nM
Citation Wilkinson, BLBornaghi, LFHouston, TAInnocenti, AVullo, DSupuran, CTPoulsen, SA Inhibition of membrane-associated carbonic anhydrase isozymes IX, XII and XIV with a library of glycoconjugate benzenesulfonamides. Bioorg Med Chem Lett17:987-92 (2007) 
 
Carbonic anhydrase 12
Name:Carbonic anhydrase 12
Type:Enzyme
Mol. Mass.:39456.00
Organism:Homo sapiens (Human)
Description:Catalytic domain of human cloned isozyme was used in the assay
Residue:354
BDBM12945
NameBDBM12945
Synonyms:(1-{[(2R,3S,4S,5R,6S)-3,4,5-trihydroxy-6-methoxyoxan-2-yl]methyl}-1H-1,2,3-triazol-4-yl)methyl 4-sulfamoylbenzoate Glycoconjugate Benzene Sulfonamide 3gg | Methyl 6-deoxy-6-(4-{4-sulfamoylbenzoyloxy}methyl-1H-1,2,3-triazol-1-yl)-alpha-D-glucopyranoside
TypeSmall organic molecule
Emp. Form.C17H22N4O9S
Mol. Mass.458.443
SMILESCO[C@H]1O[C@H](Cn2cc(COC(=O)c3ccc(cc3)S(N)(=O)=O)nn2)[C@@H](O)[C@H](O)[C@H]1O