Reaction Details
TargetCarbonic anhydrase 14
LigandBDBM50200450
Substrate/Competitorn/a
Meas. Tech.ChEMBL_441220 (CHEMBL891444)
Ki 71±n/a nM
Citation Wilkinson, BLBornaghi, LFHouston, TAInnocenti, AVullo, DSupuran, CTPoulsen, SA Inhibition of membrane-associated carbonic anhydrase isozymes IX, XII and XIV with a library of glycoconjugate benzenesulfonamides. Bioorg Med Chem Lett17:987-92 (2007) 
 
Carbonic anhydrase 14
Name:Carbonic anhydrase 14
Type:Enzyme
Mol. Mass.:37665.67
Organism:Homo sapiens (Human)
Description:Human (cloned) isozyme.
Residue:337
BDBM50200450
NameBDBM50200450
Synonyms:CHEMBL394021 | acetic acid (2S,3S,4R,5R)-4,5-diacetoxy-2-{4-[(4-sulfamoyl-benzoylamino)-methyl]-[1,2,3]triazol-1-yl}-tetrahydro-pyran-3-yl ester
TypeSmall organic molecule
Emp. Form.C21H25N5O10S
Mol. Mass.539.516
SMILESCC(=O)O[C@@H]1CO[C@@H]([C@@H](OC(C)=O)[C@@H]1OC(C)=O)n1cc(CNC(=O)c2ccc(cc2)S(N)(=O)=O)nn1